Target
Tyrosine-protein kinase receptor UFO
Ligand
BDBM50444074
Substrate
Meas. Tech.
ChEMBL_1279518 (CHEMBL3097237)
IC50
63±n/a nM
Citation
 Zhang, WZhang, DStashko, MADeRyckere, DHunter, DKireev, DMiley, MJCummings, CLee, MNorris-Drouin, JStewart, WMSather, SZhou, YKirkpatrick, GMachius, MJanzen, WPEarp, HSGraham, DKFrye, SVWang, X Pseudo-cyclization through intramolecular hydrogen bond enables discovery of pyridine substituted pyrimidines as new Mer kinase inhibitors. J Med Chem 56:9683-92 (2014)  
Target
Name:
Tyrosine-protein kinase receptor UFO
Synonyms:
AXL TEL/AXL UFO | UFO_HUMAN
Type:
Enzyme
Mol. Mass.:
98316.97
Organism:
Homo sapiens (Human)
Description:
P30530
Residue:
894
  
Inhibitor
Name:
BDBM50444074
Synonyms:
CHEMBL3092791
Type:
Small organic molecule
Emp. Form.:
C22H34N6O
Mol. Mass.:
398.545
SMILES:
CCCCNc1ncc(c(N[C@H]2CC[C@H](O)CC2)n1)-c1ccc(CN(C)C)cn1
: