Target
Acetyl-CoA carboxylase 2
Ligand
BDBM50446514
Substrate
Meas. Tech.
ChEMBL_1286312 (CHEMBL3111439)
IC50
54±n/a nM
Citation
 Bourbeau, MPSiegmund, AAllen, JGShu, HFotsch, CBartberger, MDKim, KWKomorowski, RGraham, MBusby, JWang, MMeyer, JXu, YSalyers, KFielden, MVéniant, MMGu, W Piperazine oxadiazole inhibitors of acetyl-CoA carboxylase. J Med Chem 56:10132-41 (2013)  
Target
Name:
Acetyl-CoA carboxylase 2
Synonyms:
ACACB ACC-beta ACCB Acetyl-CoA carboxylase 2 Acetyl-CoA carboxylase 2 (ACC2)
Type:
Protein
Mol. Mass.:
276535.21
Organism:
Homo sapiens (Human)
Description:
O00763
Residue:
2458
  
Inhibitor
Name:
BDBM50446514
Synonyms:
CHEMBL3110076
Type:
Small organic molecule
Emp. Form.:
C22H31N5O3
Mol. Mass.:
413.5132
SMILES:
CCOc1ccc(N2CCN([C@@H](C)C2)c2noc(n2)C2(CCC2)NC(C)=O)c(C)c1
: