Target
Alkaline phosphatase, tissue-nonspecific isozyme
Ligand
BDBM50447457
Substrate
Meas. Tech.
ChEMBL_1288275 (CHEMBL3117558)
IC50
>100000±n/a nM
Citation
 Ardecky, RJBobkova, EVKiffer-Moreira, TBrown, BGanji, SZou, JPass, INarisawa, SIano, FGRosenstein, CCheltsov, ARascon, JHedrick, MGasior, CForster, AShi, SDahl, RVasile, SSu, YSergienko, EChung, TDKaunitz, JHoylaerts, MFPinkerton, ABMillán, JL Identification of a selective inhibitor of murine intestinal alkaline phosphatase (ML260) by concurrent ultra-high throughput screening against human and mouse isozymes. Bioorg Med Chem Lett 24:1000-4 (2014)  
Target
Name:
Alkaline phosphatase, tissue-nonspecific isozyme
Synonyms:
ALPL tissue-nonspecific alkaline phosphatase precursor
Type:
PROTEIN
Mol. Mass.:
57306.17
Organism:
Homo sapiens (Human)
Description:
ChEMBL_1448917
Residue:
524
  
Inhibitor
Name:
BDBM50447457
Synonyms:
CHEMBL3115159
Type:
Small organic molecule
Emp. Form.:
C17H17N3O6S
Mol. Mass.:
391.398
SMILES:
COc1ccc(CNC(=O)CNS(=O)(=O)c2ccc3[nH]c(=O)oc3c2)cc1
: