Target
Xanthine dehydrogenase/oxidase
Ligand
BDBM50449127
Substrate
Meas. Tech.
ChEMBL_1296862 (CHEMBL3129612)
IC50
12589±n/a nM
Citation
 Evenäs, JEdfeldt, FLepistö, MSvitacheva, NSynnergren, ALundquist, BGränse, MRönnholm, AVarga, MWright, JWei, MYue, SWang, JLi, CLi, XChen, GLiao, YLv, GTjörnebo, ANarjes, F HTS followed by NMR based counterscreening. Discovery and optimization of pyrimidones as reversible and competitive inhibitors of xanthine oxidase. Bioorg Med Chem Lett 24:1315-21 (2014)  
Target
Name:
Xanthine dehydrogenase/oxidase
Synonyms:
XD XDHA XO Xanthine dehydrogenase/oxidase | Xanthine oxidase
Type:
Enzyme
Mol. Mass.:
146441.21
Organism:
Homo sapiens (Human)
Description:
P47989
Residue:
1333
  
Inhibitor
Name:
BDBM50449127
Synonyms:
CHEMBL3127118
Type:
Small organic molecule
Emp. Form.:
C10H8FN3O
Mol. Mass.:
205.1884
SMILES:
Nc1nc(-c2ccccc2)c(F)c(=O)[nH]1
: