Target
Prostaglandin D2 receptor 2
Ligand
BDBM50449255
Substrate
Meas. Tech.
ChEMBL_1295162 (CHEMBL3128663)
Ki
2.6±n/a nM
Citation
 Xiao, DZhu, XYu, YShao, NWu, JMcCormick, KDDhondi, PQin, JMazzola, RTang, HRao, ASiliphaivanh, PQiu, HYang, XRivelli, MGarlisi, CGEckel, SMukhopadhyay, GCorrell, CRindgen, DAslanian, RPalani, A Quality by design (QbD) of amide isosteres: 5,5-Disubstituted isoxazolines as potent CRTh2 antagonists with favorable pharmacokinetic and drug-like properties. Bioorg Med Chem Lett 24:1615-20 (2014)  
Target
Name:
Prostaglandin D2 receptor 2
Synonyms:
CD_antigen=CD294 Chemoattractant Receptor-homologous molecule expressed on T-helper type 2 cells (CRTH2) Chemoattractant receptor-homologous molecule expressed on Th2 cells (CRTH2) G protein-coupled receptor 44 GPR44 PTGDR2 Prostaglandin D2 receptor 2 | Prostaglandin D2 receptor 2 (PGD2)
Type:
Enzyme
Mol. Mass.:
43295.45
Organism:
Homo sapiens (Human)
Description:
Q9Y5Y4
Residue:
395
  
Inhibitor
Name:
BDBM50449255
Synonyms:
CHEMBL3125322
Type:
Small organic molecule
Emp. Form.:
C28H22FN3O4
Mol. Mass.:
483.4904
SMILES:
OC(=O)CCCCc1nc2cc(ccc2c(=O)n1-c1ccc(F)cc1)-c1cc(on1)-c1ccccc1
: