Target
Kappa-type opioid receptor
Ligand
BDBM50002041
Substrate
Meas. Tech.
ChEMBL_304044 (CHEMBL840221)
Ki
8.7±n/a nM
Citation
 Peng, YKeenan, SMZhang, QKholodovych, VWelsh, WJ 3D-QSAR comparative molecular field analysis on opioid receptor antagonists: pooling data from different studies. J Med Chem 48:1620-9 (2005)  
Target
Name:
Kappa-type opioid receptor
Synonyms:
Kappa Opioid Receptor OPRK1 Opiate Kappa 1 | mu/kappa opioid receptor
Type:
G Protein-Coupled Receptor (GPCR)
Mol. Mass.:
42744.99
Organism:
Cavia porcellus (domestic guinea pig)
Description:
P41144
Residue:
380
  
Inhibitor
Name:
BDBM50002041
Synonyms:
CHEMBL195784
Type:
Small organic molecule
Emp. Form.:
C23H24N2O3
Mol. Mass.:
376.4483
SMILES:
[H][C@@]12Oc3c4c(CC5N(CC6CC6)CCC14[C@@]5(O)Cc1cccnc21)ccc3O
: