Target
Carbonic anhydrase 9
Ligand
BDBM50005000
Substrate
Meas. Tech.
ChEMBL_965224 (CHEMBL2394009)
IC50
4.5±n/a nM
Citation
 Wang, LYang, CLu, WLiu, LGao, RLiao, SZhao, ZZhu, LXu, YLi, HHuang, JZhu, W Discovery of new potent inhibitors for carbonic anhydrase IX by structure-based virtual screening. Bioorg Med Chem Lett 23:3496-9 (2013)  
Target
Name:
Carbonic anhydrase 9
Synonyms:
CA-IX CAH9_HUMAN Carbonic anhydrase 9 (CA IX) Carbonic anhydrase 9 precursor Carbonic anhydrase IX (CAIX) Carbonic anhydrases; II & IX MN RCC-associated antigen G250
Type:
Enzyme
Mol. Mass.:
49669.03
Organism:
Homo sapiens (Human)
Description:
Catalytic domain of human cloned isozyme was used in the assay
Residue:
459
  
Inhibitor
Name:
BDBM50005000
Synonyms:
CHEMBL2392425
Type:
Small organic molecule
Emp. Form.:
C16H12BrN3O4S2
Mol. Mass.:
454.318
SMILES:
NS(=O)(=O)c1ccc(cc1)\N=C1\NC(=O)\C(S1)=C\c1cc(O)ccc1Br
: