Target
Advanced glycosylation end product-specific receptor
Ligand
BDBM50005631
Substrate
Meas. Tech.
ChEMBL_1339876 (CHEMBL3243665)
IC50
18900±n/a nM
Citation
 Han, YTKim, KChoi, GIAn, HSon, DKim, HHa, HJSon, JHChung, SJPark, HJLee, JSuh, YG Pyrazole-5-carboxamides, novel inhibitors of receptor for advanced glycation end products (RAGE). Eur J Med Chem 79:128-42 (2014)  
Target
Name:
Advanced glycosylation end product-specific receptor
Synonyms:
AGER RAGE_HUMAN | Receptor for advanced glycosylation end products
Type:
PROTEIN
Mol. Mass.:
42800.11
Organism:
Homo sapiens (Human)
Description:
ChEMBL_1339877
Residue:
404
  
Inhibitor
Name:
BDBM50005631
Synonyms:
CHEMBL3235051
Type:
Small organic molecule
Emp. Form.:
C33H41N5O4
Mol. Mass.:
571.7097
SMILES:
CCCCOc1cc(OCCCN(CC)CC)ccc1NC(=O)c1cc(nn1C)-c1ccc(Oc2ccccn2)cc1
: