Target
RAF proto-oncogene serine/threonine-protein kinase
Ligand
BDBM50010465
Substrate
Meas. Tech.
ChEMBL_1353328 (CHEMBL3267830)
IC50
32±n/a nM
Citation
 Aoki, THyohdoh, IFuruichi, NOzawa, SWatanabe, FMatsushita, MSakaitani, MMorikami, KTakanashi, KHarada, NTomii, YShiraki, KFurumoto, KTabo, MYoshinari, KOri, KAoki, YShimma, NIikura, H Optimizing the Physicochemical Properties of Raf/MEK Inhibitors by Nitrogen Scanning. ACS Med Chem Lett 5:309-14 (2014)  
Target
Name:
RAF proto-oncogene serine/threonine-protein kinase
Synonyms:
C-Raf Protein Kinase RAF RAF1 Raf-1 Serine/threonine-protein kinase C-Raf | cRaf
Type:
Serine/threonine-protein kinase
Mol. Mass.:
73082.52
Organism:
Homo sapiens (Human)
Description:
P04049
Residue:
648
  
Inhibitor
Name:
BDBM50010465
Synonyms:
CHEMBL3263996
Type:
Small organic molecule
Emp. Form.:
C20H22N4O6S
Mol. Mass.:
446.477
SMILES:
CNS(=O)(=O)Nc1cc(Cc2c(C)c3ccc(OC(=O)N(C)C)cc3oc2=O)ccn1
: