Target
Legumain
Ligand
BDBM50015343
Substrate
Meas. Tech.
ChEMBL_1347909 (CHEMBL3267446)
IC50
49±n/a nM
Citation
 Higgins, CBouazzaoui, SGaddale, KD'Costa, ZTempleman, AO'Rourke, MYoung, AScott, CHarrison, TMullan, PWilliams, R P3 SAR exploration of biphenyl carbamate based Legumain inhibitors. Bioorg Med Chem Lett 24:2521-4 (2014)  
Target
Name:
Legumain
Synonyms:
3.4.22.34 LGMN PRSC1 | Protease, cysteine 1
Type:
Mol. Mass.:
49411.12
Organism:
Homo sapiens (Human)
Description:
Residue:
433
  
Inhibitor
Name:
BDBM50015343
Synonyms:
CHEMBL3264276
Type:
Small organic molecule
Emp. Form.:
C26H30N4O4
Mol. Mass.:
462.5408
SMILES:
CC(C)c1cccc(c1)-c1ccc(COC(=O)N2CCC[C@H]2C(=O)N[C@@H](CC(N)=O)C#N)cc1
: