Target
Legumain
Ligand
BDBM50015349
Substrate
Meas. Tech.
ChEMBL_1347909 (CHEMBL3267446)
IC50
79±n/a nM
Citation
 Higgins, CBouazzaoui, SGaddale, KD'Costa, ZTempleman, AO'Rourke, MYoung, AScott, CHarrison, TMullan, PWilliams, R P3 SAR exploration of biphenyl carbamate based Legumain inhibitors. Bioorg Med Chem Lett 24:2521-4 (2014)  
Target
Name:
Legumain
Synonyms:
3.4.22.34 LGMN PRSC1 | Protease, cysteine 1
Type:
Mol. Mass.:
49411.12
Organism:
Homo sapiens (Human)
Description:
Residue:
433
  
Inhibitor
Name:
BDBM50015349
Synonyms:
CHEMBL3264579
Type:
Small organic molecule
Emp. Form.:
C23H22F2N4O4
Mol. Mass.:
456.442
SMILES:
NC(=O)C[C@H](NC(=O)[C@@H]1CCCN1C(=O)OCc1ccc(cc1)-c1cc(F)cc(F)c1)C#N
: