Target
Catechol O-methyltransferase
Ligand
BDBM50019329
Substrate
Meas. Tech.
ChEMBL_1362902 (CHEMBL3291944)
Ki
1.000000±n/a nM
Citation
 Lanier, MAmbrus, GCole, DCDavenport, REllery, JFosbeary, RJennings, AJKadotani, AKamada, YKamran, RMatsumoto, SMizukami, AOkubo, SOkada, KSaikatendu, KWalsh, LWu, HHixon, MS A fragment-based approach to identifying S-adenosyl-l-methionine -competitive inhibitors of catechol O-methyl transferase (COMT). J Med Chem 57:5459-63 (2014)  
Target
Name:
Catechol O-methyltransferase
Synonyms:
COMT Catechol O-methyltransferase | Catechol O-methyltransferase (MB-COMT)
Type:
Enzyme
Mol. Mass.:
30030.67
Organism:
Homo sapiens (Human)
Description:
P21964
Residue:
271
  
Inhibitor
Name:
BDBM50019329
Synonyms:
CHEMBL1089318
Type:
Small organic molecule
Emp. Form.:
C15H10Cl2N4O6
Mol. Mass.:
413.169
SMILES:
Cc1c(Cl)c(C)[n+]([O-])c(Cl)c1-c1noc(n1)-c1cc(O)c(O)c(c1)[N+]([O-])=O
: