Target
D(1A) dopamine receptor
Ligand
BDBM50027074
Substrate
Meas. Tech.
ChEMBL_1439002 (CHEMBL3383109)
Ki
>100000±n/a nM
Citation
 Berry, CBBubser, MJones, CKHayes, JPWepy, JALocuson, CWDaniels, JSLindsley, CWHopkins, CR Discovery and Characterization of ML398, a Potent and Selective Antagonist of the D4 Receptor with in Vivo Activity. ACS Med Chem Lett 5:1060-4 (2014)  
Target
Name:
D(1A) dopamine receptor
Synonyms:
DA D1 receptor DRD1 Dopamine D1 receptor Dopamine D1A
Type:
Enzyme
Mol. Mass.:
49303.43
Organism:
Homo sapiens (Human)
Description:
P21728
Residue:
446
  
Inhibitor
Name:
BDBM50027074
Synonyms:
CHEMBL3335537
Type:
Small organic molecule
Emp. Form.:
C20H23N3O
Mol. Mass.:
321.4161
SMILES:
C(Cc1ccccc1)[C@@H]1CN(Cc2nc3ccccc3[nH]2)CCO1
: