Target
D(3) dopamine receptor
Ligand
BDBM50027079
Substrate
Meas. Tech.
ChEMBL_1439004 (CHEMBL3383111)
Ki
2770±n/a nM
Citation
 Berry, CBBubser, MJones, CKHayes, JPWepy, JALocuson, CWDaniels, JSLindsley, CWHopkins, CR Discovery and Characterization of ML398, a Potent and Selective Antagonist of the D4 Receptor with in Vivo Activity. ACS Med Chem Lett 5:1060-4 (2014)  
Target
Name:
D(3) dopamine receptor
Synonyms:
DOPAMINE D3 DRD3_HUMAN Dopamine D3 receptor (D3) Dopamine receptor Dopamine receptor D3
Type:
Mol. Mass.:
44243.43
Organism:
Homo sapiens (Human)
Description:
Residue:
400
  
Inhibitor
Name:
BDBM50027079
Synonyms:
CHEMBL3335539
Type:
Small organic molecule
Emp. Form.:
C20H25NO2
Mol. Mass.:
311.418
SMILES:
COc1ccc(CN2CCOC(CCc3ccccc3)C2)cc1
: