Target
D(4) dopamine receptor
Ligand
BDBM50027081
Substrate
Meas. Tech.
ChEMBL_1439005 (CHEMBL3383112)
Ki
28±n/a nM
Citation
 Berry, CBBubser, MJones, CKHayes, JPWepy, JALocuson, CWDaniels, JSLindsley, CWHopkins, CR Discovery and Characterization of ML398, a Potent and Selective Antagonist of the D4 Receptor with in Vivo Activity. ACS Med Chem Lett 5:1060-4 (2014)  
Target
Name:
D(4) dopamine receptor
Synonyms:
D(2C) dopamine receptor DOPAMINE D4.2 DRD4 Dopamine D4 receptor
Type:
Enzyme
Mol. Mass.:
48373.19
Organism:
Homo sapiens (Human)
Description:
P21917
Residue:
419
  
Inhibitor
Name:
BDBM50027081
Synonyms:
CHEMBL3335555
Type:
Small organic molecule
Emp. Form.:
C19H23NO2
Mol. Mass.:
297.3914
SMILES:
Oc1ccc(CN2CCO[C@H](CCc3ccccc3)C2)cc1
: