Target
Cytochrome P450 1A2
Ligand
BDBM50027083
Substrate
Meas. Tech.
ChEMBL_1439017 (CHEMBL3383664)
IC50
13100±n/a nM
Citation
 Berry, CBBubser, MJones, CKHayes, JPWepy, JALocuson, CWDaniels, JSLindsley, CWHopkins, CR Discovery and Characterization of ML398, a Potent and Selective Antagonist of the D4 Receptor with in Vivo Activity. ACS Med Chem Lett 5:1060-4 (2014)  
Target
Name:
Cytochrome P450 1A2
Synonyms:
CP1A2_HUMAN CYPIA2 Cytochrome P(3)450 Cytochrome P450 1A2 (CYP1A2) Cytochrome P450-P3
Type:
Enzyme
Mol. Mass.:
58423.38
Organism:
Homo sapiens (Human)
Description:
P05177
Residue:
516
  
Inhibitor
Name:
BDBM50027083
Synonyms:
CHEMBL3335556
Type:
Small organic molecule
Emp. Form.:
C19H22ClNO
Mol. Mass.:
315.837
SMILES:
Clc1ccc(CN2CCO[C@H](CCc3ccccc3)C2)cc1
: