Target
D(4) dopamine receptor
Ligand
BDBM50027261
Substrate
Meas. Tech.
ChEMBL_1439005 (CHEMBL3383112)
Ki
1070±n/a nM
Citation
 Berry, CBBubser, MJones, CKHayes, JPWepy, JALocuson, CWDaniels, JSLindsley, CWHopkins, CR Discovery and Characterization of ML398, a Potent and Selective Antagonist of the D4 Receptor with in Vivo Activity. ACS Med Chem Lett 5:1060-4 (2014)  
Target
Name:
D(4) dopamine receptor
Synonyms:
D(2C) dopamine receptor DOPAMINE D4.2 DRD4 Dopamine D4 receptor
Type:
Enzyme
Mol. Mass.:
48373.19
Organism:
Homo sapiens (Human)
Description:
P21917
Residue:
419
  
Inhibitor
Name:
BDBM50027261
Synonyms:
CHEMBL3335545
Type:
Small organic molecule
Emp. Form.:
C19H21F2NO
Mol. Mass.:
317.3729
SMILES:
Fc1cccc(F)c1CN1CCOC(CCc2ccccc2)C1
: