Target
Adenosine receptor A1
Ligand
BDBM50330631
Substrate
Meas. Tech.
ChEMBL_1439617 (CHEMBL3383135)
Ki
11±n/a nM
Citation
 Giovannoni, MPCiciani, GCilibrizzi, ACrocetti, LDaniele, SDi Cesare Mannelli, LGhelardini, CGiacomelli, CGuerrini, GMartini, CTrincavelli, MLVergelli, C Further studies on pyrazolo[1',5':1,6]pyrimido[4,5-d]pyridazin-4(3H)-ones as potent and selective human A1 adenosine receptor antagonists. Eur J Med Chem 89:32-41 (2014)  
Target
Name:
Adenosine receptor A1
Synonyms:
A1 adenosine receptor (hA1) AA1R_HUMAN ADORA1 Adenosine A1-receptor Adenosine receptor A1 (hA1) | Adenosine transporter (AdT)
Type:
G Protein-Coupled Receptor (GPCR)
Mol. Mass.:
36520.92
Organism:
Homo sapiens (Human)
Description:
P30542
Residue:
326
  
Inhibitor
Name:
BDBM50330631
Synonyms:
3-Benzyl-9-phenyl-1-pyridin-3-yl-pyrazolo[1',5':1,6]pyrimido[4,5-d]pyridazin-4(3H)-one | CHEMBL1277116
Type:
Small organic molecule
Emp. Form.:
C26H18N6O
Mol. Mass.:
430.4607
SMILES:
O=c1n(Cc2ccccc2)nc(-c2cccnc2)c2c3cc(nn3cnc12)-c1ccccc1
: