Target
Serine/threonine-protein kinase PLK4
Ligand
BDBM25117
Substrate
Meas. Tech.
ChEMBL_1450850 (CHEMBL3364609)
Ki
4.2±n/a nM
Citation
 Sampson, PBLiu, YPatel, NKFeher, MForrest, BLi, SWEdwards, LLaufer, RLang, YBan, FAwrey, DEMao, GPlotnikova, OLeung, GHodgson, RMason, JMWei, XKiarash, RGreen, EQiu, WChirgadze, NYMak, TWPan, GPauls, HW The discovery of Polo-like kinase 4 inhibitors: design and optimization of spiro[cyclopropane-1,3'[3H]indol]-2'(1'H).ones as orally bioavailable antitumor agents. J Med Chem 58:130-46 (2015)  
Target
Name:
Serine/threonine-protein kinase PLK4
Synonyms:
PLK4 Polo-Like Kinase 4 STK18 | Serine/threonine-protein kinase PLK4
Type:
PROTEIN
Mol. Mass.:
108996.91
Organism:
Homo sapiens (Human)
Description:
ChEMBL_1474078
Residue:
970
  
Inhibitor
Name:
BDBM25117
Synonyms:
AG-013736 N-methyl-2-({3-[(E)-2-(pyridin-2-yl)ethenyl]-1H-indazol-6-yl}sulfanyl)benzamide US9205078, Axitinib | US9617222, Compound A
Type:
Small organic molecule
Emp. Form.:
C22H18N4OS
Mol. Mass.:
386.47
SMILES:
CNC(=O)c1ccccc1Sc1ccc2c(\C=C\c3ccccn3)n[nH]c2c1
: