Target
Serine/threonine-protein kinase PLK4
Ligand
BDBM50044652
Substrate
Meas. Tech.
ChEMBL_1450851 (CHEMBL3364610)
IC50
0.790000±n/a nM
Citation
 Sampson, PBLiu, YPatel, NKFeher, MForrest, BLi, SWEdwards, LLaufer, RLang, YBan, FAwrey, DEMao, GPlotnikova, OLeung, GHodgson, RMason, JMWei, XKiarash, RGreen, EQiu, WChirgadze, NYMak, TWPan, GPauls, HW The discovery of Polo-like kinase 4 inhibitors: design and optimization of spiro[cyclopropane-1,3'[3H]indol]-2'(1'H).ones as orally bioavailable antitumor agents. J Med Chem 58:130-46 (2015)  
Target
Name:
Serine/threonine-protein kinase PLK4
Synonyms:
PLK4 Polo-Like Kinase 4 STK18 | Serine/threonine-protein kinase PLK4
Type:
PROTEIN
Mol. Mass.:
108996.91
Organism:
Homo sapiens (Human)
Description:
ChEMBL_1474078
Residue:
970
  
Inhibitor
Name:
BDBM50044652
Synonyms:
CHEMBL3353352 US9907800, Example A208
Type:
Small organic molecule
Emp. Form.:
C28H25FN4O
Mol. Mass.:
452.5227
SMILES:
CN(C)Cc1ccc(\C=C\c2n[nH]c3cc(ccc23)[C@@H]2C[C@@]22C(=O)Nc3ccc(F)cc23)cc1
: