Target
Metabotropic glutamate receptor 5
Ligand
BDBM50047396
Substrate
Meas. Tech.
ChEMBL_1447652 (CHEMBL3374988)
EC50
437±n/a nM
Citation
 Turlington, MNoetzel, MJBridges, TMVinson, PNSteckler, TLavreysen, HMackie, CBartolomé-Nebreda, JMConde-Ceide, STong, HMMacdonald, GJDaniels, JSJones, CKNiswender, CMConn, PJLindsley, CWStauffer, SR Discovery and SAR of a novel series of metabotropic glutamate receptor 5 positive allosteric modulators with high ligand efficiency. Bioorg Med Chem Lett 24:3641-6 (2014)  
Target
Name:
Metabotropic glutamate receptor 5
Synonyms:
GRM5_RAT Grm5 Mglur5 metabotropic glutamate 5/1-C metabotropic glutamate 5a
Type:
Enzyme
Mol. Mass.:
131900.14
Organism:
Rattus norvegicus (Rat)
Description:
P31424
Residue:
1203
  
Inhibitor
Name:
BDBM50047396
Synonyms:
CHEMBL3311001
Type:
Small organic molecule
Emp. Form.:
C14H13NO2S
Mol. Mass.:
259.324
SMILES:
O=C1CCCc2nc(COc3ccccc3)sc12
: