Target
Somatostatin receptor type 3
Ligand
BDBM50054513
Substrate
Meas. Tech.
ChEMBL_1447893 (CHEMBL3378640)
IC50
67±n/a nM
Citation
 He, SLai, ZYe, ZDobbelaar, PHShah, SKTruong, QDu, WGuo, LLiu, JJian, TQi, HBakshi, RKHong, QDellureficio, JReibarkh, MSamuel, KReddy, VBMitelman, STong, SXChicchi, GGTsao, KLTrusca, DWu, MShao, QTrujillo, MEFernandez, GNelson, DBunting, PKerr, JFitzgerald, PMorissette, PVolksdorf, SEiermann, GJLi, CZhang, BHoward, ADZhou, YPNargund, RPHagmann, WK Investigation of Cardiovascular Effects of Tetrahydro-ß-carboline sstr3 antagonists. ACS Med Chem Lett 5:748-53 (2014)  
Target
Name:
Somatostatin receptor type 3
Synonyms:
SOMATOSTATIN SST3 SS3-R SSR-28 SSTR3 | Somatostatin receptor type 3 (SSTR3)
Type:
Protein
Mol. Mass.:
45855.97
Organism:
Homo sapiens (Human)
Description:
P32745
Residue:
418
  
Inhibitor
Name:
BDBM50054513
Synonyms:
CHEMBL3323080
Type:
Small organic molecule
Emp. Form.:
C30H24FN7O2
Mol. Mass.:
533.5557
SMILES:
Cn1cc(cn1)[C@]1(N[C@H](Cc2c1[nH]c1ccccc21)c1nc(c[nH]1)-c1ccc(F)cc1)c1cccc(n1)C(O)=O
: