Target
Receptor-type tyrosine-protein kinase FLT3
Ligand
BDBM50055499
Substrate
Meas. Tech.
ChEMBL_1451365 (CHEMBL3363649)
IC50
3.0±n/a nM
Citation
 Zhang, WDeRyckere, DHunter, DLiu, JStashko, MAMinson, KACummings, CTLee, MGlaros, TGNewton, DLSather, SZhang, DKireev, DJanzen, WPEarp, HSGraham, DKFrye, SVWang, X UNC2025, a potent and orally bioavailable MER/FLT3 dual inhibitor. J Med Chem 57:7031-41 (2014)  
Target
Name:
Receptor-type tyrosine-protein kinase FLT3
Synonyms:
CD135 FL cytokine receptor FLK2 FLT3 Fetal liver kinase-2 Fms-like tyrosine kinase 3 (Flt-3) STK-1 Stem cell tyrosine kinase 1
Type:
Enzyme
Mol. Mass.:
112888.62
Organism:
Homo sapiens (Human)
Description:
P36888
Residue:
993
  
Inhibitor
Name:
BDBM50055499
Synonyms:
CHEMBL3326002
Type:
Small organic molecule
Emp. Form.:
C25H34N6O4S
Mol. Mass.:
514.64
SMILES:
CCCCNc1ncc2c(nn([C@H]3CC[C@H](O)CC3)c2n1)-c1ccc(cc1)S(=O)(=O)N1CCOCC1
: