Target
Acetylcholinesterase
Ligand
BDBM50327939
Substrate
Meas. Tech.
ChEMBL_1447985 (CHEMBL3379811)
Ki
2090±n/a nM
Citation
 Hamulakova, SJanovec, LHrabinova, MSpilovska, KKorabecny, JKristian, PKuca, KImrich, J Synthesis and biological evaluation of novel tacrine derivatives and tacrine-coumarin hybrids as cholinesterase inhibitors. J Med Chem 57:7073-84 (2014)  
Target
Name:
Acetylcholinesterase
Synonyms:
ACES_HUMAN Acetylcholinesterase (AChE) | Acetylcholinesterase (human AChE)
Type:
Enzyme
Mol. Mass.:
67792.70
Organism:
Homo sapiens (Human)
Description:
P22303
Residue:
614
  
Inhibitor
Name:
BDBM50327939
Synonyms:
7-methoxytacrine | CHEMBL1256415
Type:
Small organic molecule
Emp. Form.:
C14H16N2O
Mol. Mass.:
228.2896
SMILES:
COc1ccc2nc3CCCCc3c(N)c2c1
: