Target
DNA-dependent protein kinase catalytic subunit
Ligand
BDBM50156495
Substrate
Meas. Tech.
ChEMBL_1460641 (CHEMBL3395882)
IC50
14±n/a nM
Citation
 Andrs, MKorabecny, JJun, DHodny, ZBartek, JKuca, K Phosphatidylinositol 3-Kinase (PI3K) and phosphatidylinositol 3-kinase-related kinase (PIKK) inhibitors: importance of the morpholine ring. J Med Chem 58:41-71 (2015)  
Target
Name:
DNA-dependent protein kinase catalytic subunit
Synonyms:
DNA-PK catalytic subunit DNA-dependent protein kinase (DNA-PK) DNA-dependent protein kinase catalytic subunit (DNA-PK) HYRC PRKDC | PRKDC_HUMAN
Type:
Protein
Mol. Mass.:
469114.78
Organism:
Homo sapiens (Human)
Description:
P78527
Residue:
4128
  
Inhibitor
Name:
BDBM50156495
Synonyms:
8-(dibenzo[b,d]thiophen-4-yl)-2-morpholino-4H-chromen-4-one 8-dibenzothiophen-1-yl-2-morpholin-4-yl-chromen-4-one NU-7432 | NU-7441
Type:
Small organic molecule
Emp. Form.:
C25H19NO3S
Mol. Mass.:
413.488
SMILES:
O=c1cc(oc2c(cccc12)-c1cccc2c3ccccc3sc12)N1CCOCC1
: