Target
DNA-dependent protein kinase catalytic subunit
Ligand
BDBM50156503
Substrate
Meas. Tech.
ChEMBL_1460641 (CHEMBL3395882)
IC50
41±n/a nM
Citation
 Andrs, MKorabecny, JJun, DHodny, ZBartek, JKuca, K Phosphatidylinositol 3-Kinase (PI3K) and phosphatidylinositol 3-kinase-related kinase (PIKK) inhibitors: importance of the morpholine ring. J Med Chem 58:41-71 (2015)  
Target
Name:
DNA-dependent protein kinase catalytic subunit
Synonyms:
DNA-PK catalytic subunit DNA-dependent protein kinase (DNA-PK) DNA-dependent protein kinase catalytic subunit (DNA-PK) HYRC PRKDC | PRKDC_HUMAN
Type:
Protein
Mol. Mass.:
469114.78
Organism:
Homo sapiens (Human)
Description:
P78527
Residue:
4128
  
Inhibitor
Name:
BDBM50156503
Synonyms:
8-Dibenzofuran-4-yl-2-morpholin-4-yl-chromen-4-one CHEMBL186048
Type:
Small organic molecule
Emp. Form.:
C25H19NO4
Mol. Mass.:
397.4227
SMILES:
O=c1cc(oc2c(cccc12)-c1cccc2c1oc1ccccc21)N1CCOCC1
: