Target
DNA-dependent protein kinase catalytic subunit
Ligand
BDBM50059638
Substrate
Meas. Tech.
ChEMBL_1460641 (CHEMBL3395882)
IC50
13±n/a nM
Citation
 Andrs, MKorabecny, JJun, DHodny, ZBartek, JKuca, K Phosphatidylinositol 3-Kinase (PI3K) and phosphatidylinositol 3-kinase-related kinase (PIKK) inhibitors: importance of the morpholine ring. J Med Chem 58:41-71 (2015)  
Target
Name:
DNA-dependent protein kinase catalytic subunit
Synonyms:
DNA-PK catalytic subunit DNA-dependent protein kinase (DNA-PK) DNA-dependent protein kinase catalytic subunit (DNA-PK) HYRC PRKDC | PRKDC_HUMAN
Type:
Protein
Mol. Mass.:
469114.78
Organism:
Homo sapiens (Human)
Description:
P78527
Residue:
4128
  
Inhibitor
Name:
BDBM50059638
Synonyms:
CHEMBL3393499
Type:
Small organic molecule
Emp. Form.:
C24H19N3O2S
Mol. Mass.:
413.492
SMILES:
O=c1cc(nc2c(cccn12)-c1cccc2c3ccccc3sc12)N1CCOCC1
: