Target
DNA-dependent protein kinase catalytic subunit
Ligand
BDBM50398037
Substrate
Meas. Tech.
ChEMBL_1460643 (CHEMBL3395884)
IC50
400±n/a nM
Citation
 Andrs, MKorabecny, JJun, DHodny, ZBartek, JKuca, K Phosphatidylinositol 3-Kinase (PI3K) and phosphatidylinositol 3-kinase-related kinase (PIKK) inhibitors: importance of the morpholine ring. J Med Chem 58:41-71 (2015)  
Target
Name:
DNA-dependent protein kinase catalytic subunit
Synonyms:
DNA-PK catalytic subunit DNA-dependent protein kinase (DNA-PK) DNA-dependent protein kinase catalytic subunit (DNA-PK) HYRC PRKDC | PRKDC_HUMAN
Type:
Protein
Mol. Mass.:
469114.78
Organism:
Homo sapiens (Human)
Description:
P78527
Residue:
4128
  
Inhibitor
Name:
BDBM50398037
Synonyms:
CHEMBL2181110
Type:
Small organic molecule
Emp. Form.:
C11H13NO3
Mol. Mass.:
207.2258
SMILES:
Oc1cc(ccc1C=O)N1CCOCC1
: