Target
DNA-dependent protein kinase catalytic subunit
Ligand
BDBM50059641
Substrate
Meas. Tech.
ChEMBL_1460643 (CHEMBL3395884)
IC50
35±n/a nM
Citation
 Andrs, MKorabecny, JJun, DHodny, ZBartek, JKuca, K Phosphatidylinositol 3-Kinase (PI3K) and phosphatidylinositol 3-kinase-related kinase (PIKK) inhibitors: importance of the morpholine ring. J Med Chem 58:41-71 (2015)  
Target
Name:
DNA-dependent protein kinase catalytic subunit
Synonyms:
DNA-PK catalytic subunit DNA-dependent protein kinase (DNA-PK) DNA-dependent protein kinase catalytic subunit (DNA-PK) HYRC PRKDC | PRKDC_HUMAN
Type:
Protein
Mol. Mass.:
469114.78
Organism:
Homo sapiens (Human)
Description:
P78527
Residue:
4128
  
Inhibitor
Name:
BDBM50059641
Synonyms:
CHEMBL3393501
Type:
Small organic molecule
Emp. Form.:
C17H17NO4
Mol. Mass.:
299.3212
SMILES:
Oc1ccc(cc1)C(=O)c1ccc(cc1O)N1CCOCC1
: