Target
Serine/threonine-protein kinase mTOR
Ligand
BDBM50059648
Substrate
Meas. Tech.
ChEMBL_1460649 (CHEMBL3395890)
IC50
23±n/a nM
Citation
 Andrs, MKorabecny, JJun, DHodny, ZBartek, JKuca, K Phosphatidylinositol 3-Kinase (PI3K) and phosphatidylinositol 3-kinase-related kinase (PIKK) inhibitors: importance of the morpholine ring. J Med Chem 58:41-71 (2015)  
Target
Name:
Serine/threonine-protein kinase mTOR
Synonyms:
FK506-binding protein 12-rapamycin complex-associated protein 1 FRAP FRAP1 MTOR Mammalian Target of Rapamycin (mTOR) RAFT1 Rapamycin and FKBP12 target 1 Serine/threonine-protein kinase (mTOR) | mTORC2
Type:
Rapamycin target protein
Mol. Mass.:
288917.12
Organism:
Homo sapiens (Human)
Description:
P42345
Residue:
2549
  
Inhibitor
Name:
BDBM50059648
Synonyms:
CHEMBL3393594
Type:
Small organic molecule
Emp. Form.:
C22H27N7O3
Mol. Mass.:
437.4949
SMILES:
CNC(=O)Nc1ccc(cc1)-c1nc(nc2n(ncc12)C1CCOCC1)N1CCOCC1
: