Target
MAP kinase-interacting serine/threonine-protein kinase 2
Ligand
BDBM50059656
Substrate
Meas. Tech.
ChEMBL_1460926 (CHEMBL3396746)
Kd
920±n/a nM
Citation
 Koch, PGehringer, MLaufer, SA Inhibitors of c-Jun N-terminal kinases: an update. J Med Chem 58:72-95 (2015)  
Target
Name:
MAP kinase-interacting serine/threonine-protein kinase 2
Synonyms:
GPRK7 MAP kinase-interacting serine/threonine-protein kinase 2 (MKNK2) MAP-kinase interacting kinase 2 (MNK2) MKNK2_HUMAN | MNK2
Type:
Protein
Mol. Mass.:
51870.79
Organism:
Homo sapiens (Human)
Description:
Q9HBH9
Residue:
465
  
Inhibitor
Name:
BDBM50059656
Synonyms:
CHEMBL3393601
Type:
Small organic molecule
Emp. Form.:
C15H9N3O
Mol. Mass.:
247.2515
SMILES:
O\N=C1\c2ccccc2-c2nc3ccccc3nc12
: