Target
Mitogen-activated protein kinase 8
Ligand
BDBM86636
Substrate
Meas. Tech.
ChEMBL_1460937 (CHEMBL3396757)
IC50
1.3±n/a nM
Citation
 Koch, PGehringer, MLaufer, SA Inhibitors of c-Jun N-terminal kinases: an update. J Med Chem 58:72-95 (2015)  
Target
Name:
Mitogen-activated protein kinase 8
Synonyms:
JNK-46 JNK1-alpha-1 MK08_HUMAN PRKM8 SAPK1C c-Jun N-terminal kinase 1 c-Jun N-terminal kinase 1(JNK1) | c-Jun N-terminal kinase 2 (JNK2)
Type:
Enzyme
Mol. Mass.:
48297.57
Organism:
Homo sapiens (Human)
Description:
JNK-1 was purchased from Upstate Cell Signaling Solutions (formerly Upstate Biotechnology).
Residue:
427
  
Inhibitor
Name:
BDBM86636
Synonyms:
JNK-IN-11
Type:
Small organic molecule
Emp. Form.:
C36H32N8O2
Mol. Mass.:
608.6917
SMILES:
CN(C)C\C=C\C(=O)Nc1cccc(c1)C(=O)Nc1ccc(Nc2nccc(n2)-c2c(nn3ccccc23)-c2ccccc2)cc1
: