Target
Mitogen-activated protein kinase 8
Ligand
BDBM50059649
Substrate
Meas. Tech.
ChEMBL_1460655 (CHEMBL3395896)
IC50
1.000000±n/a nM
Citation
 Koch, PGehringer, MLaufer, SA Inhibitors of c-Jun N-terminal kinases: an update. J Med Chem 58:72-95 (2015)  
Target
Name:
Mitogen-activated protein kinase 8
Synonyms:
JNK-46 JNK1-alpha-1 MK08_HUMAN PRKM8 SAPK1C c-Jun N-terminal kinase 1 c-Jun N-terminal kinase 1(JNK1) | c-Jun N-terminal kinase 2 (JNK2)
Type:
Enzyme
Mol. Mass.:
48297.57
Organism:
Homo sapiens (Human)
Description:
JNK-1 was purchased from Upstate Cell Signaling Solutions (formerly Upstate Biotechnology).
Residue:
427
  
Inhibitor
Name:
BDBM50059649
Synonyms:
CHEMBL3220493
Type:
Small organic molecule
Emp. Form.:
C21H21ClN6O2
Mol. Mass.:
424.883
SMILES:
NC(=O)c1ccccc1Nc1nc(Nc2ccc(cc2)N2CCOCC2)ncc1Cl
: