Target
Metabotropic glutamate receptor 5
Ligand
BDBM50064472
Substrate
Meas. Tech.
ChEMBL_1464920 (CHEMBL3404390)
IC50
218±n/a nM
Citation
 Martín-Martín, MLBartolomé-Nebreda, JMConde-Ceide, SAlonso de Diego, SALópez, SMartínez-Viturro, CMTong, HMLavreysen, HMacdonald, GJSteckler, TMackie, CBridges, TMDaniels, JSNiswender, CMNoetzel, MJJones, CKConn, PJLindsley, CWStauffer, SR Discovery and SAR of novel series of imidazopyrimidinones and dihydroimidazopyrimidinones as positive allosteric modulators of the metabotropic glutamate receptor 5 (mGlu5). Bioorg Med Chem Lett 25:1310-7 (2015)  
Target
Name:
Metabotropic glutamate receptor 5
Synonyms:
GRM5_RAT Grm5 Mglur5 metabotropic glutamate 5/1-C metabotropic glutamate 5a
Type:
Enzyme
Mol. Mass.:
131900.14
Organism:
Rattus norvegicus (Rat)
Description:
P31424
Residue:
1203
  
Inhibitor
Name:
BDBM50064472
Synonyms:
CHEMBL3401192
Type:
Small organic molecule
Emp. Form.:
C19H13ClFN3O2
Mol. Mass.:
369.777
SMILES:
Fc1ccc(cc1)-n1ccc2nc(COc3ccccc3)c(Cl)n2c1=O
: