Target
Renin
Ligand
BDBM50392953
Substrate
Meas. Tech.
ChEMBL_1465911 (CHEMBL3406559)
IC50
0.900000±n/a nM
Citation
 McKittrick, BACaldwell, JPBara, TBoykow, GChintala, MClader, JCzarniecki, MCourneya, BDuffy, RFleming, LGiessert, RGreenlee, WJHeap, CHong, LHuang, YIserloh, UJosien, HKhan, TKorfmacher, WLiang, XMazzola, RMitra, SMoore, KOrth, PRajagopalan, MRoy, SSakwa, SStrickland, CVaccaro, HVoigt, JWang, HWong, JZhang, RZych, A Iminopyrimidinones: a novel pharmacophore for the development of orally active renin inhibitors. Bioorg Med Chem Lett 25:1592-6 (2015)  
Target
Name:
Renin
Synonyms:
Angiotensinogenase RENI_HUMAN
Type:
Enzyme
Mol. Mass.:
45058.99
Organism:
Homo sapiens (Human)
Description:
Residue:
406
  
Inhibitor
Name:
BDBM50392953
Synonyms:
CHEMBL2152353
Type:
Small organic molecule
Emp. Form.:
C30H45ClN4O4
Mol. Mass.:
561.156
SMILES:
CC[C@H](C[C@H](O)[C@@H](N)CN1CC(=O)N(CC1(C)C)c1ccccc1Cl)C(=O)NC1C2CC3CC1CC(O)(C3)C2
: