Target
Renin
Ligand
BDBM98678
Substrate
Meas. Tech.
ChEMBL_1465911 (CHEMBL3406559)
IC50
0.200000±n/a nM
Citation
 McKittrick, BACaldwell, JPBara, TBoykow, GChintala, MClader, JCzarniecki, MCourneya, BDuffy, RFleming, LGiessert, RGreenlee, WJHeap, CHong, LHuang, YIserloh, UJosien, HKhan, TKorfmacher, WLiang, XMazzola, RMitra, SMoore, KOrth, PRajagopalan, MRoy, SSakwa, SStrickland, CVaccaro, HVoigt, JWang, HWong, JZhang, RZych, A Iminopyrimidinones: a novel pharmacophore for the development of orally active renin inhibitors. Bioorg Med Chem Lett 25:1592-6 (2015)  
Target
Name:
Renin
Synonyms:
Angiotensinogenase RENI_HUMAN
Type:
Enzyme
Mol. Mass.:
45058.99
Organism:
Homo sapiens (Human)
Description:
Residue:
406
  
Inhibitor
Name:
BDBM98678
Synonyms:
US8497286, 154
Type:
Small organic molecule
Emp. Form.:
C26H42N4O4
Mol. Mass.:
474.6361
SMILES:
CCOC[C@@H](CC(C)C)NC(=O)[C@@H]1CNC[C@@H]([C@@H]1O)C(=O)N(C1CC1)c1ccc(cn1)C(C)C
: