Target
Serine/threonine-protein kinase PLK4
Ligand
BDBM50044665
Substrate
Meas. Tech.
ChEMBL_1467184 (CHEMBL3411381)
IC50
0.750000±n/a nM
Citation
 Sampson, PBLiu, YForrest, BCumming, GLi, SWPatel, NKEdwards, LLaufer, RFeher, MBan, FAwrey, DEMao, GPlotnikova, OHodgson, RBeletskaya, IMason, JMLuo, XNadeem, VWei, XKiarash, RMadeira, BHuang, PMak, TWPan, GPauls, HW The discovery of Polo-like kinase 4 inhibitors: identification of (1R,2S).2-(3-((E).4-(((cis).2,6-dimethylmorpholino)methyl)styryl). 1H.indazol-6-yl)-5'-methoxyspiro[cyclopropane-1,3'-indolin]-2'-one (CFI-400945) as a potent, orally active antitumor agent. J Med Chem 58:147-69 (2015)  
Target
Name:
Serine/threonine-protein kinase PLK4
Synonyms:
PLK4 Polo-Like Kinase 4 STK18 | Serine/threonine-protein kinase PLK4
Type:
PROTEIN
Mol. Mass.:
108996.91
Organism:
Homo sapiens (Human)
Description:
ChEMBL_1474078
Residue:
970
  
Inhibitor
Name:
BDBM50044665
Synonyms:
CHEMBL3353341 US9907800, Example A33
Type:
Small organic molecule
Emp. Form.:
C30H30N6O2
Mol. Mass.:
506.5982
SMILES:
COc1ccc2NC(=O)[C@@]3(C[C@H]3c3ccc4c(\C=C\c5ccc(nc5)N5CCN(C)CC5)n[nH]c4c3)c2c1
: