Target
Translocator protein
Ligand
BDBM50073588
Substrate
Meas. Tech.
ChEMBL_1467413 (CHEMBL3411697)
Ki
0.870000±n/a nM
Citation
 Banister, SDBeinat, CWilkinson, SMShen, BBartoli, CSelleri, SDa Pozzo, EMartini, CChin, FTKassiou, M Ether analogues of DPA-714 with subnanomolar affinity for the translocator protein (TSPO). Eur J Med Chem 93:392-400 (2015)  
Target
Name:
Translocator protein
Synonyms:
BZRP Mitochondrial benzodiazepine receptor PKBS Peripheral-type benzodiazepine receptor TSPO_HUMAN
Type:
Enzyme
Mol. Mass.:
18834.74
Organism:
Homo sapiens (Human)
Description:
P30536
Residue:
169
  
Inhibitor
Name:
BDBM50073588
Synonyms:
CHEMBL3408974
Type:
Small organic molecule
Emp. Form.:
C19H25FN2O
Mol. Mass.:
316.413
SMILES:
CCN(CC)C(=O)[C@H]1CCCc2c1c1ccccc1n2CCF
: