Target
NAD-dependent protein deacylase sirtuin-6
Ligand
BDBM27507
Substrate
Meas. Tech.
ChEMBL_1470852 (CHEMBL3418054)
IC50
184000±n/a nM
Citation
 Li, YYou, LHuang, WLiu, JZhu, HHe, B A FRET-based assay for screening SIRT6 modulators. Eur J Med Chem 96:245-9 (2015)  
Target
Name:
NAD-dependent protein deacylase sirtuin-6
Synonyms:
NAD-dependent protein deacetylase sirtuin-6 Regulatory protein SIR2 homolog 6 SIR2L6 SIRT6 | Sirtuin-6 (SIRT6)
Type:
Protein
Mol. Mass.:
39133.03
Organism:
Homo sapiens (Human)
Description:
Q8N6T7
Residue:
355
  
Inhibitor
Name:
BDBM27507
Synonyms:
3-Pyridinecarboxamide NAM nicotinamide | pyridine-3-carboxamide
Type:
Emp. Form.:
C6H6N2O
Mol. Mass.:
122.1246
SMILES:
NC(=O)c1cccnc1
: