Target
11-beta-hydroxysteroid dehydrogenase type 2
Ligand
BDBM50080412
Substrate
Meas. Tech.
ChEMBL_1474766 (CHEMBL3424223)
IC50
299600±n/a nM
Citation
 Chen, XQShao, LDPal, MShen, YCheng, XXu, GPeng, LYWang, KPan, ZHLi, MMLeng, YHe, JZhao, QS Hupehenols A-E, selective 11ß-hydroxysteroid dehydrogenase type 1 (11ß-HSD1) inhibitors from Viburnum hupehense. J Nat Prod 78:330-4 (2015)  
Target
Name:
11-beta-hydroxysteroid dehydrogenase type 2
Synonyms:
11-DH2 11-beta-Hydroxysteroid Dehydrogenase 2 (11-beta-HSD2) 11-beta-hydroxysteroid dehydrogenase 2 11-beta-hydroxysteroid dehydrogenase type 2 (11-beta-HSD2) DHI2_HUMAN HSD11K SDR9C3
Type:
Enzyme
Mol. Mass.:
44141.72
Organism:
Homo sapiens (Human)
Description:
Purified recombinant human 11beta-HSD2.
Residue:
405
  
Inhibitor
Name:
BDBM50080412
Synonyms:
CHEMBL3422266
Type:
Small organic molecule
Emp. Form.:
C24H38O5
Mol. Mass.:
406.5555
SMILES:
[H][C@@]12[C@H](O)CC(=O)[C@@]1(C)[C@]1(C)CC[C@@]3([H])C(C)(C)[C@@H](O)CC[C@]3(C)[C@@]1([H])C[C@H]2OC(C)=O
: