Target
11-beta-hydroxysteroid dehydrogenase 1
Ligand
BDBM50080413
Substrate
Meas. Tech.
ChEMBL_1474762 (CHEMBL3424219)
IC50
15±n/a nM
Citation
 Chen, XQShao, LDPal, MShen, YCheng, XXu, GPeng, LYWang, KPan, ZHLi, MMLeng, YHe, JZhao, QS Hupehenols A-E, selective 11ß-hydroxysteroid dehydrogenase type 1 (11ß-HSD1) inhibitors from Viburnum hupehense. J Nat Prod 78:330-4 (2015)  
Target
Name:
11-beta-hydroxysteroid dehydrogenase 1
Synonyms:
11-DH 11-beta-Hydroxysteroid Dehydrogenase 1 (11-beta-HSD1) 11-beta-hydroxysteroid dehydrogenase 1 (11HSD1) Corticosteroid 11-beta-dehydrogenase isozyme 1 (11-beta-HSD-1) Corticosteroid 11-beta-dehydrogenase isozyme 1 (11beta-HSD1) HSD11 HSD11L | SDR26C1
Type:
Enzyme
Mol. Mass.:
32409.16
Organism:
Homo sapiens (Human)
Description:
P28845
Residue:
292
  
Inhibitor
Name:
BDBM50080413
Synonyms:
CHEMBL3422265
Type:
Small organic molecule
Emp. Form.:
C25H40O5
Mol. Mass.:
420.5821
SMILES:
[H][C@@]12[C@@H](CC(=O)[C@@]1(C)[C@]1(C)CC[C@@]3([H])C(C)(C)[C@@H](O)CC[C@]3(C)[C@@]1([H])C[C@H]2OC(C)=O)OC
: