Target
Beta-hexosaminidase subunit alpha/beta
Ligand
BDBM18512
Substrate
Meas. Tech.
ChEMBL_1496351 (CHEMBL3579955)
IC50
15000±n/a nM
Citation
 Tropak, MBZhang, JYonekawa, SRigat, BAAulakh, VSSmith, MRHwang, HJCiufolini, MAMahuran, DJ Pyrimethamine Derivatives: Insight into Binding Mechanism and Improved Enhancement of Mutantß-N-acetylhexosaminidase Activity. J Med Chem 58:4483-93 (2015)  
Target
Name:
Beta-hexosaminidase subunit alpha/beta
Synonyms:
Beta-N-acetyl-D-hexosaminidase-A/B
Type:
Mol. Mass.:
Description:
ASSAY_ID of ChEMBL is 1496351
Components:
This complex has 2 components.
Component 1
Name:
Beta-hexosaminidase subunit alpha
Synonyms:
Beta-N-acetylhexosaminidase subunit alpha HEXA | HEXA_HUMAN
Type:
Protein
Mol. Mass.:
60688.46
Organism:
Homo sapiens (Human)
Description:
P06865
Residue:
529
  
Component 2
Name:
Beta-hexosaminidase subunit beta
Synonyms:
Beta-N-acetylhexosaminidase subunit beta Beta-hexosaminidase subunit beta (Hex B) HEXB_HUMAN | Hexosaminidase subunit B
Type:
Enzyme
Mol. Mass.:
63112.58
Organism:
Homo sapiens (Human)
Description:
P07686
Residue:
556
  
Inhibitor
Name:
BDBM18512
Synonyms:
5-(4-chlorophenyl)-6-ethylpyrimidine-2,4-diamine Pyrimethamine (Pyr) cid_4993
Type:
Small organic molecule
Emp. Form.:
C12H13ClN4
Mol. Mass.:
248.711
SMILES:
CCc1nc(N)nc(N)c1-c1ccc(Cl)cc1
: