Target
Potassium voltage-gated channel subfamily H member 2
Ligand
BDBM50108647
Substrate
Meas. Tech.
ChEMBL_1506711 (CHEMBL3598727)
IC50
21060±n/a nM
Citation
 Deng, QLim, YHAnand, RYu, YKim, JHZhou, WZheng, JTempest, PLevorse, DZhang, XGreene, SMullins, DCulberson, CSherborne, BParker, EMStamford, AAli, A Use of molecular modeling aided design to dial out hERG liability in adenosine A(2A) receptor antagonists. Bioorg Med Chem Lett 25:2958-62 (2015)  
Target
Name:
Potassium voltage-gated channel subfamily H member 2
Synonyms:
1,3-beta-glucan synthase component GLS2 ERG Eag-related protein 1 Ether-a-go-go-related gene (HERG) Ether-a-go-go-related gene potassium channel 1 Ether-a-go-go-related gene potassium channel 1 (hERG1) Ether-a-go-go-related protein 1 H-ERG KCNH2 Potassium voltage-gated channel subfamily H member 2 (hERG) Voltage-gated potassium channel subunit Kv11.1 hERG Potassium Channel 1 | putative potassium channel subunit
Type:
Multi-pass membrane protein
Mol. Mass.:
126672.65
Organism:
Homo sapiens (Human)
Description:
Q12809
Residue:
1159
  
Inhibitor
Name:
BDBM50108647
Synonyms:
CHEMBL3596512
Type:
Small organic molecule
Emp. Form.:
C23H27N7O2
Mol. Mass.:
433.5062
SMILES:
COc1cccc(c1)N1CCN(Cc2nc3c4cccc(OC)c4nc(N)n3n2)[C@H](C)C1
: