Target
Adenosine receptor A1
Ligand
BDBM50108647
Substrate
Meas. Tech.
ChEMBL_1506710 (CHEMBL3598726)
Ki
4990±n/a nM
Citation
 Deng, QLim, YHAnand, RYu, YKim, JHZhou, WZheng, JTempest, PLevorse, DZhang, XGreene, SMullins, DCulberson, CSherborne, BParker, EMStamford, AAli, A Use of molecular modeling aided design to dial out hERG liability in adenosine A(2A) receptor antagonists. Bioorg Med Chem Lett 25:2958-62 (2015)  
Target
Name:
Adenosine receptor A1
Synonyms:
A1 adenosine receptor (hA1) AA1R_HUMAN ADORA1 Adenosine A1-receptor Adenosine receptor A1 (hA1) | Adenosine transporter (AdT)
Type:
G Protein-Coupled Receptor (GPCR)
Mol. Mass.:
36520.92
Organism:
Homo sapiens (Human)
Description:
P30542
Residue:
326
  
Inhibitor
Name:
BDBM50108647
Synonyms:
CHEMBL3596512
Type:
Small organic molecule
Emp. Form.:
C23H27N7O2
Mol. Mass.:
433.5062
SMILES:
COc1cccc(c1)N1CCN(Cc2nc3c4cccc(OC)c4nc(N)n3n2)[C@H](C)C1
: