Target
Adenosine receptor A2a
Ligand
BDBM50108647
Substrate
Meas. Tech.
ChEMBL_1506709 (CHEMBL3598725)
Ki
7.7±n/a nM
Citation
 Deng, QLim, YHAnand, RYu, YKim, JHZhou, WZheng, JTempest, PLevorse, DZhang, XGreene, SMullins, DCulberson, CSherborne, BParker, EMStamford, AAli, A Use of molecular modeling aided design to dial out hERG liability in adenosine A(2A) receptor antagonists. Bioorg Med Chem Lett 25:2958-62 (2015)  
Target
Name:
Adenosine receptor A2a
Synonyms:
A2A adenosine receptor (hA2A) ADENOSINE A2 ADORA2 Adenosine A2A receptor (A2AAR)
Type:
G Protein-Coupled Receptor (GPCR)
Mol. Mass.:
44716.46
Organism:
Homo sapiens (Human)
Description:
P29274
Residue:
412
  
Inhibitor
Name:
BDBM50108647
Synonyms:
CHEMBL3596512
Type:
Small organic molecule
Emp. Form.:
C23H27N7O2
Mol. Mass.:
433.5062
SMILES:
COc1cccc(c1)N1CCN(Cc2nc3c4cccc(OC)c4nc(N)n3n2)[C@H](C)C1
: