Target
Transient receptor potential cation channel subfamily M member 8
Ligand
BDBM50117636
Substrate
Meas. Tech.
ChEMBL_1514520 (CHEMBL3616044)
IC50
30000±n/a nM
Citation
 Wei, ZLNguyen, MTO'Mahony, DJAcevedo, AZipfel, SZhang, QLiu, LDourado, MChi, CYip, VDeFalco, JGustafson, AEmerling, DEKelly, MGKincaid, JVincent, FDuncton, MA Identification of orally-bioavailable antagonists of the TRPV4 ion-channel. Bioorg Med Chem Lett 25:4011-5 (2015)  
Target
Name:
Transient receptor potential cation channel subfamily M member 8
Synonyms:
LTRPC6 TRPM8_HUMAN Transient receptor potential M8 protein (TRPM8) Transient receptor potential cation channel subfamily M member 8 (TRPM8)
Type:
Enzyme
Mol. Mass.:
127693.26
Organism:
Homo sapiens (Human)
Description:
Q7Z2W7
Residue:
1104
  
Inhibitor
Name:
BDBM50117636
Synonyms:
CHEMBL3613642
Type:
Small organic molecule
Emp. Form.:
C21H23F3N4O5S
Mol. Mass.:
500.491
SMILES:
CC(C)N1CCN(CC1)S(=O)(=O)c1ccc(NC(=O)c2ccc(cc2[N+]([O-])=O)C(F)(F)F)cc1
: