Target
Transient receptor potential cation channel subfamily V member 4
Ligand
BDBM50117644
Substrate
Meas. Tech.
ChEMBL_1514408 (CHEMBL3615487)
IC50
1940±n/a nM
Citation
 Wei, ZLNguyen, MTO'Mahony, DJAcevedo, AZipfel, SZhang, QLiu, LDourado, MChi, CYip, VDeFalco, JGustafson, AEmerling, DEKelly, MGKincaid, JVincent, FDuncton, MA Identification of orally-bioavailable antagonists of the TRPV4 ion-channel. Bioorg Med Chem Lett 25:4011-5 (2015)  
Target
Name:
Transient receptor potential cation channel subfamily V member 4
Synonyms:
TRPV4_RAT Vanilloid receptor | Vroac
Type:
PROTEIN
Mol. Mass.:
98016.72
Organism:
Rattus norvegicus
Description:
ChEMBL_1514408
Residue:
871
  
Inhibitor
Name:
BDBM50117644
Synonyms:
CHEMBL3613630
Type:
Small organic molecule
Emp. Form.:
C21H24F3N3O3S
Mol. Mass.:
455.494
SMILES:
CC(C)N1CCN(CC1)S(=O)(=O)c1ccc(NC(=O)c2cccc(c2)C(F)(F)F)cc1
: