Target
Transient receptor potential cation channel subfamily V member 4
Ligand
BDBM50117639
Substrate
Meas. Tech.
ChEMBL_1514407 (CHEMBL3615486)
IC50
380±n/a nM
Citation
 Wei, ZLNguyen, MTO'Mahony, DJAcevedo, AZipfel, SZhang, QLiu, LDourado, MChi, CYip, VDeFalco, JGustafson, AEmerling, DEKelly, MGKincaid, JVincent, FDuncton, MA Identification of orally-bioavailable antagonists of the TRPV4 ion-channel. Bioorg Med Chem Lett 25:4011-5 (2015)  
Target
Name:
Transient receptor potential cation channel subfamily V member 4
Synonyms:
TRPV4 Transient receptor potential cation channel subfamily V member 4 (TRPV4) VROAC
Type:
Enzyme
Mol. Mass.:
98290.10
Organism:
Homo sapiens (Human)
Description:
Q9HBA0
Residue:
871
  
Inhibitor
Name:
BDBM50117639
Synonyms:
CHEMBL3613640
Type:
Small organic molecule
Emp. Form.:
C21H23F4N3O3S
Mol. Mass.:
473.484
SMILES:
CC(C)N1CCN(CC1)S(=O)(=O)c1ccc(NC(=O)c2ccc(cc2F)C(F)(F)F)cc1
: