Target
Beta-secretase 1
Ligand
BDBM50129288
Substrate
Meas. Tech.
ChEMBL_1523398 (CHEMBL3630425)
pH
5±n/a
Ki
110±n/a nM
Comments
extracted
Citation
 Boy, KMGuernon, JMWu, YJZhang, YShi, JZhai, WZhu, SGerritz, SWToyn, JHMeredith, JEBarten, DMBurton, CRAlbright, CFGood, ACGrace, JELentz, KAOlson, REMacor, JEThompson, LA Macrocyclic prolinyl acyl guanidines as inhibitors of฿-secretase (BACE). Bioorg Med Chem Lett 25:5040-7 (2015)  
Target
Name:
Beta-secretase 1
Synonyms:
ASP2 Aspartyl protease 2 BACE1 Beta-secretase (BACE) Beta-secretase 1 (BACE 1) Beta-secretase 1 (BACE1) Beta-site amyloid precursor protein cleaving enzyme 1 Memapsin-2 beta-Secretase (BACE-1) | beta-Secretase (BACE1)
Type:
Protein
Mol. Mass.:
55755.10
Organism:
Homo sapiens (Human)
Description:
P56817
Residue:
501
  
Inhibitor
Name:
BDBM50129288
Synonyms:
CHEMBL3627969
Type:
Small organic molecule
Emp. Form.:
C22H25Cl2N5O3
Mol. Mass.:
478.372
SMILES:
COc1ccc(cc1)N1CCC[C@H]1C(=O)\N=C(/N)NCc1cc(Cl)c(NC(C)=O)c(Cl)c1
: