Target
Potassium voltage-gated channel subfamily H member 2
Ligand
BDBM50134443
Substrate
Meas. Tech.
ChEMBL_1545013 (CHEMBL3749967)
IC50
>10000±n/a nM
Citation
 Conde-Ceide, SAlcázar, JAlonso de Diego, SALópez, SMartín-Martín, MLMartínez-Viturro, CMPena, MATong, HMLavreysen, HMackie, CBridges, TMDaniels, JSNiswender, CMJones, CKMacdonald, GJSteckler, TConn, PJStauffer, SRLindsley, CWBartolomé-Nebreda, JM Preliminary investigation of 6,7-dihydropyrazolo[1,5-a]pyrazin-4-one derivatives as a novel series of mGlu5 receptor positive allosteric modulators with efficacy in preclinical models of schizophrenia. Bioorg Med Chem Lett 26:429-34 (2016)  
Target
Name:
Potassium voltage-gated channel subfamily H member 2
Synonyms:
1,3-beta-glucan synthase component GLS2 ERG Eag-related protein 1 Ether-a-go-go-related gene (HERG) Ether-a-go-go-related gene potassium channel 1 Ether-a-go-go-related gene potassium channel 1 (hERG1) Ether-a-go-go-related protein 1 H-ERG KCNH2 Potassium voltage-gated channel subfamily H member 2 (hERG) Voltage-gated potassium channel subunit Kv11.1 hERG Potassium Channel 1 | putative potassium channel subunit
Type:
Multi-pass membrane protein
Mol. Mass.:
126672.65
Organism:
Homo sapiens (Human)
Description:
Q12809
Residue:
1159
  
Inhibitor
Name:
BDBM50134443
Synonyms:
CHEMBL3746457
Type:
Small organic molecule
Emp. Form.:
C18H15FN4O2
Mol. Mass.:
338.3357
SMILES:
Fc1ccc(nc1)N1CCn2nc(COc3ccccc3)cc2C1=O
: